D - F
type: Concept

FGBNMS
type: Concept
change note: 2019-08-15 11:13:29.0 [tstevens] Insert Concept add broader relation (Flower Garden Banks NMS [52d25f01-494e-40f7-905c-066fe56d9d2e,369041] - D - F [24cf4b0e-4464-4edb-8f0c-415e851a6d79,349759]);
change note: 2019-08-15 15:34:44.0 [tstevens] update PrefLabel (FGBNMS);
change note: 2019-08-15 11:15:42.0 [tstevens] insert AltLabel (id: null category: primary text: Flower Garden Banks National Marine Sanctuary language code: en); insert Definition (id: null text: The Flower Garden Banks NMS is the only marine sanctuary located in the Gulf of Mexico. Our interactive map allows users to view sanctuary data, photographs, and shaded relief, along with reference data that includes buoys, artificial reefs, and climatology. The Flower Garden Banks National Marine Sanctuary (NMS) Maps application uses ESRI's ArcGIS server technology to integrate data and imagery into a user-friendly interface. The map was created in partnership with NOAA's National Marine Sanctuaries program. language code: en);
definition: The Flower Garden Banks NMS is the only marine sanctuary located in the Gulf of Mexico. Our interactive map allows users to view sanctuary data, photographs, and shaded relief, along with reference data that includes buoys, artificial reefs, and climatology. The Flower Garden Banks National Marine Sanctuary (NMS) Maps application uses ESRI's ArcGIS server technology to integrate data and imagery into a user-friendly interface. The map was created in partnership with NOAA's National Marine Sanctuaries program.
in scheme: projects