IRMSS
type: Concept
in scheme: instruments
definition: [Source: "The IRMSS for CBERS", Wang Huaiyi, Ma Wenpo, Beijing Institute of Space Machine and Electricity, Beijing] The IRMSS is a cross-track scanning imaging radiometer mainly operating in the infrared. It has one Panchromatic (Pan) band, two short-wave infrared (SWIR) bands and one long-wave infrared (LWIR) band. The spatial resolution of the Pan and SWIR bands is 78m in an orbit altitude of 778km while the LWIR band is 156m. Its swath is 120km, and the global coverage period is 26 days, Its key design characteristics are summarized in Table 1. The IRMSS mainly include a scanner mainframe, an amplifier assembly, and encoder, a power supply assembly, a command & telemetry assembly, a radiative cooler controller and a thermal controller. The scanner mainframe is composed of the mainframe structure, the linear scan mirror assembly, the scanning angle monitor, the telescope, the scan line corrector, the onboard calibration system, the relay optics, the focal plane assemblies, the pre-amplifiers and the radiative cooler. Group: Instrument_Details Entry_ID: IRMSS Group: Instrument_Identification Instrument_Category: Earth Remote Sensing Instruments Instrument_Class: Passive Remote Sensing Instrument_Type: Spectrometers/Radiometers Instrument_Subtype: Imaging Spectrometers/Radiometers Short_Name: IRMSS Long_Name: Infrared Multispectral Scanner End_Group Group: Instrument_Associated_Sensors Short_Name: CAMERAS End_Group Group: Associated_Platforms Short_Name: CBERS-1 Short_Name: CBERS-2 End_Group Group: Spectral_Frequency_Information Wavelength_Keyword: Near Infrared Spectral_Frequency_Coverage_Range: 1.55 µm - 1.75 µm, End_Group Group: Spectral_Frequency_Information Wavelength_Keyword: Near Infrared Spectral_Frequency_Coverage_Range: 0.50 µm - 0.90 µm End_Group Group: Spectral_Frequency_Information Wavelength_Keyword: Infrared > Reflected Spectral_Frequency_Coverage_Range: 2.08 µm - 2.35 µm End_Group Group: Spectral_Frequency_Information Wavelength_Keyword: Infrared > T…

Imaging Spectrometers/Radiometers
type: Concept