OCEAN WAVES
type: Concept

WAVE OVERTOPPING
type: Concept
change note: 2017-12-28 11:27:55.0 [sritz] Insert Concept add broader relation (WAVE OVERTOPPING [5377fb64-b10a-4284-9b7b-be77b4c16fe5,310501] - OCEAN WAVES [a04804d5-1064-48fd-a7a7-8da8e10399e1,84567]);
in scheme: sciencekeywords
definition: Wave overtopping refers to the volumetric rate at which wave runup flows over the top or crest of a slope, be it a beach, dune, or structure.