IGNEOUS ROCK AGE DETERMINATIONS
type: Concept
change note: 2013-03-13 14:07:28.0 [tbs1979] insert Definition (id: null text: An analysis and determination of the age of igneous rocks language code: en);
change note: 2013-03-05 10:52:50.0 [tbs1979] Insert Concept add broader relation (IGNEOUS ROCK AGE DETERMINATIONS [53e3eeca-265b-42d8-ad64-bfcc2acdad26,82967] - IGNEOUS ROCKS [e8d97ffd-2fd2-4989-88a7-9772fc9b7cd8,62085]);
in scheme: sciencekeywords
definition: An analysis and determination of the age of igneous rocks

IGNEOUS ROCKS
type: Concept