ORBIT VELOCITY
type: Concept
change note: 2013-04-02 10:11:00.0 [tbs1979] insert Definition (id: null text: The orbital speed of a body (satellite) in a gravitational field. language code: en);
change note: 2013-02-18 09:42:37.0 [tbs1979] Insert Concept add broader relation (ORBIT VELOCITY [53eeb68a-615d-42d0-9c6b-ddfe0d0eb2c7,82391] - SATELLITE ORBITS/REVOLUTION [71278ba7-9a13-43ba-9ec3-62ae2b39de88,62977]);
in scheme: sciencekeywords
definition: The orbital speed of a body (satellite) in a gravitational field.

SATELLITE ORBITS/REVOLUTION
type: Concept