ACADEMIC
type: Concept

CALSTATE-MB/WI/CCOWS/ECOVIZ
type: Concept
in scheme: providers
definition: Ecosystem Science and Visualization : Yellowstone National Park provides access to data other products arising from our wildlife ecological and landscape research in Yellowstone National Park. Research will involve development of remote sensing products (land cover, phenology, snowpack, geothermals), simulation models (snowpack, phenology, animal behavior), a data bundle and approach to integration of interdisciplinary data, and continued development of the Tarsier software framework for dynamic, interactive systems integration and visualization of the Earth System. The result will be a unification of data with diverse interdisciplinary field data on wildlife tracking, snowpack, geothermals, and other system elements â€“ thus leveraging products toward new knowledge.