GRACE-FO TriG
type: Concept
change note: 2021-06-22 15:12:25.0 [mmorahan] insert AltLabel (id: null category: primary text: GRACE-FO Tri-GNSS Radio Occultation receiver language code: en); insert AltLabel (id: null category: null text: Tri-GNSS Radio Occultation receiver language code: en); insert Definition (id: null text: The GRACE-FO Trig-RO receiver upgrades the capabilities offered by BlackJack/IGOR GPS science receivers in order to meet NASA’s decadal survey recommendations. This includes the ability to track not only GPS, but additional GNSS signals, including Galileo, CDMA GLONASS and Compass. language code: en);
change note: 2021-06-22 15:07:16.0 [mmorahan] Insert Concept add broader relation (GRACE-FO TriG [54927026-f395-40b5-a451-df4e4e06e037,649578] - Positioning/Navigation [596a5700-b3fd-4261-b8f8-a054d052e3fe,641400]);
change note: 2021-06-22 15:15:47.0 [mmorahan] insert WeightedRelation (id: null related concept uuid: f75e34e2-ebe7-4a6c-8bf6-da596a36b632 relationship type: null relationship value: null generated by: null);
alternative label: Tri-GNSS Radio Occultation receiver
in scheme: instruments
definition: The GRACE-FO Trig-RO receiver upgrades the capabilities offered by BlackJack/IGOR GPS science receivers in order to meet NASA’s decadal survey recommendations. This includes the ability to track not only GPS, but additional GNSS signals, including Galileo, CDMA GLONASS and Compass.

Positioning/Navigation
type: Concept