TIDAL CURRENTS
type: Concept
in scheme: sciencekeywords
definition: Mass flow of water induced by the raising or lowering of sea level owing to passage of tidal crests or troughs.

TIDES
type: Concept