FI/FMI
type: Concept
in scheme: providers
definition: We produce weather services to meet customer demands. Almost all our weather products are custom made. The customer is able to define the content of a service together with our specialists. Summary provided by http://www.fmi.fi/en/index.html

FINLAND
type: Concept