LANDSLIDE
type: Concept
change note: 2013-04-01 09:33:31.0 [tbs1979] insert Definition (id: null text: The down slope movement of soil, rock, and other weathered materials because of gravity. language code: en);
change note: 2013-02-18 10:53:45.0 [tbs1979] Insert Concept add broader relation (LANDSLIDE [54e5d072-5a2c-471b-bca0-7e4ca32a2001,82493] - FLUVIAL PROCESSES [6f47ae88-f28f-43e3-be6a-34f86b15fe19,82419]);
in scheme: sciencekeywords
definition: The down slope movement of soil, rock, and other weathered materials because of gravity.

FLUVIAL PROCESSES
type: Concept