NASA
type: Concept

NASA/GSFC/OMISIPS
type: Concept
change note: 2017-06-12 14:21:55.0 [sritz] insert Definition (id: null text: The Ozone Monitoring Instrument (OMI) is a Dutch-Finnish instrument on board NASA’s Aura Satellite, launched in July 2004. OMI is a wide swath, nadir viewing, near-UV and visible spectrograph that measures ozone columns and profiles, aerosols, clouds, surface ultraviolet (UV) irradiance, and the trace gases Nitrogen Dioxide (NO2), Sulfuric Dioxide (SO2), and Formaldehyde (OHCLO). The OMI Near Real-Time (NRT) capability is a joint development of NASA and the Royal Netherlands Meteorological Institute (KNMI). LANCE-OMI provides certain OMI Level 2 and Level 3 products on a near real-time basis. On average, the Level 2 products are available within 3.5 hours of the observation time. The products are available on either FTP server: omisips1.omisips.eosdis.nasa.gov or ominrt2.omisips.eosdis.nasa.gov and from the LANCE OMI Near Real-Time Products page on the Ozone & Air Quality website and from NASA's Worldview data viualization tool. language code: en);
change note: 2014-03-20 17:12:21.0 [mpmorahan] Insert Concept add broader relation (NASA/GSFC/OMISIPS [557e9df4-f2f2-4d52-8788-c32aaf07e8b5,106241] - NASA [4fd0aa9d-1a80-4dde-8452-c69b5c4d08cc,66479]);
change note: 2014-03-20 17:25:23.0 [mpmorahan] insert AltLabel (id: null text: OZONE MONITORING INSTRUMENT (OMI) SIPS language code: en);
definition: The Ozone Monitoring Instrument (OMI) is a Dutch-Finnish instrument on board NASA’s Aura Satellite, launched in July 2004. OMI is a wide swath, nadir viewing, near-UV and visible spectrograph that measures ozone columns and profiles, aerosols, clouds, surface ultraviolet (UV) irradiance, and the trace gases Nitrogen Dioxide (NO2), Sulfuric Dioxide (SO2), and Formaldehyde (OHCLO). The OMI Near Real-Time (NRT) capability is a joint development of NASA and the Royal Netherlands Meteorological Institute (KNMI). LANCE-OMI provides certain OMI Level 2 and Level 3 products on a near real-time basis. On average, the Level 2 products are available within 3.5 hours of the observation time. The products are available on either FTP server: omisips1.omisips.eosdis.nasa.gov or ominrt2.omisips.eosdis.nasa.gov and from the LANCE OMI Near Real-Time Products page on the Ozone & Air Quality website and from NASA's Worldview data viualization tool.
in scheme: providers