CD
type: Concept
in scheme: providers
definition: APRWeather by Convective Development provides current and forecasted weather information directly to its clients. Website: http://www.aprweather.com/

COMMERCIAL
type: Concept