MARINE ENVIRONMENT MONITORING
type: Concept

MARINE OBSTRUCTIONS
type: Concept
in scheme: sciencekeywords
definition: The act of watching,keeping track of or checking the ocean(pelagic or bottom conditions) for a special purpose.