EVOLANTA
type: Concept
in scheme: projects
definition: The aim of the EVOLANTA program is to provide a framework for research to improve our understanding of the evolutionary history and biology of unique Antarctic biota, and to integrate this with developing knowledge of the climatic and tectonic context within which this evolution has occured and continues to occur. Focus: 1. gene flow 2. evolutionary response to global change 3, Antarctic/Arctic comparisons For more information , link to "http://www.sun.ac.za/zoology/scar/acrobat/Evolbiosciplan.pdf"

D - F
type: Concept