Geoton-L1 (2)
type: Concept
change note: 2015-08-03 12:24:50.0 [mpmorahan] insert AltLabel (id: null text: Geoton-L1 language code: en);
change note: 2015-08-03 12:22:20.0 [mpmorahan] Insert Concept add broader relation (Geoton-L1 (2) [5787cc42-b51a-44ca-862e-7132b1e0d5c8,158151] - Imaging Spectrometers/Radiometers [944b7691-af37-4fb4-9393-c114e7997829,144651]);
in scheme: instruments
definition: Earth Remote Sensing Instrument (Geoton-L1 (2)) Group: Instrument_Details Entry_ID: Geoton-L1 (2) Group: Instrument_Identification Instrument_Category: Earth Remote Sensing Instruments Instrument_Class: Passive Remote Sensing Instrument_Type: Spectrometers/Radiometers Instrument_Subtype: Imaging Spectrometers/Radiometers Short_Name: Geoton-L1 (2) Long_Name: Geoton-L1 End_Group Group: Associated_Platforms Short_Name: Resurs-P N1 Short_Name: Resurs-P N2 End_Group Group: Spectral_Frequency_Information Wavelength_Keyword: Visible Spectral_Frequency_Coverage_Range: 0.58 µm - 0.8 µm End_Group Group: Spectral_Frequency_Information Wavelength_Keyword: Near Infrared Spectral_Frequency_Coverage_Range: 0.58 µm - 0.8 µm End_Group Group: Spectral_Frequency_Information Wavelength_Keyword: Visible Spectral_Frequency_Coverage_Range: 0.45 µm - 0.52 µm End_Group Group: Spectral_Frequency_Information Wavelength_Keyword: Visible Spectral_Frequency_Coverage_Range: 0.52 µm - 0.6 µm End_Group Group: Spectral_Frequency_Information Wavelength_Keyword: Visible Spectral_Frequency_Coverage_Range: 0.61 µm - 0.68 µm End_Group Group: Spectral_Frequency_Information Wavelength_Keyword: Visible Spectral_Frequency_Coverage_Range: 0.72 µm - 0.80 µm End_Group Group: Spectral_Frequency_Information Wavelength_Keyword: Near Infrared Spectral_Frequency_Coverage_Range: 0.72 µm - 0.80 µm End_Group Group: Spectral_Frequency_Information Wavelength_Keyword: Near Infrared Spectral_Frequency_Coverage_Range: 0.80 µm - 0.90 µm End_Group Sample_Image: http://www.mcc.rsa.ru/Pic/pr/resurs_p_2/4b.jpg Creation_Date: 2015-01-26 Group: Instrument_Logistics Instrument_Owner: Russia/ROSCOSMOS End_Group End_Group

Imaging Spectrometers/Radiometers
type: Concept