ENVIRONMENTAL GOVERNANCE/MANAGEMENT
type: Concept

ENVIRONMENTAL REGULATIONS
type: Concept
change note: 2012-06-29 14:26:02.0 [tbs1979] insert Definition (id: null text: Environmental laws or regulations impacting companies. language code: en);
change note: 2012-06-27 13:49:05.0 [tbs1979] Insert Concept add broader relation (ENVIRONMENTAL REGULATIONS [57df059e-578a-4371-9484-7a34d63edfa5,40205] - ENVIRONMENTAL GOVERNANCE/MANAGEMENT [d81b77be-0177-4e26-942c-aa911239482d,40199]);
in scheme: sciencekeywords
definition: Environmental laws or regulations impacting companies.