BARNACLES
type: Concept
change note: 2017-03-09 15:46:36.0 [mgenazzi] Definition added insert Definition (id: null text: Cone shaped shell-wall comprised of calcareous plates sessile, marine intertidal crustaceans. language code: en);
in scheme: sciencekeywords
definition: Cone shaped shell-wall comprised of calcareous plates sessile, marine intertidal crustaceans.

CRUSTACEANS
type: Concept