TRANS-NINO INDEX
type: Concept
change note: 2020-02-14 13:10:44.0 [tstevens] Remove Concepts delete narrower relation (null);
change note: 2012-06-25 13:22:23.0 [mpmorahan] Insert Concept add narrower relation (TRANS-NINO INDEX [58d71334-7fb5-4e05-85fd-9d2485854abe,21885] - TNI [aaa9c9eb-9d46-4015-a735-8938e0ed4506,39765]);
change note: 2012-06-25 12:09:18.0 [mpmorahan] Move Concepts add broader relation (TRANS-NINO INDEX [58d71334-7fb5-4e05-85fd-9d2485854abe,21885] - SEA SURFACE TEMPERATURE INDICES [b83895e9-bac8-49fe-bcf5-8fe4d8fcaa16,39747]); delete broader relation (null);
in scheme: sciencekeywords
definition: The timeseries is calculated from the HadISST and the NCEP OI Datasets. It is the standardized Nina 12 minus the Nina 4 with a 5 month running mean applied which is then standardized using the 1950-1979 period.

SEA SURFACE TEMPERATURE INDICES
type: Concept