HRG-1
type: Concept
in scheme: instruments
definition: [Source: Earth Observation Satellites and Sensors for Risk Management, http://www.space-risks.com/SpaceData/index.php?Satellite_Name=SPOT+5&id_page=8 ] The panchromatic resolution is 2.5m / 5 m. Imagery at a resolution of 2.5 metres in the panchromatic band is obtained using a sampling concept unique to SPOT 5, called Supermode. This concept processes two 5-metre panchromatic images acquired simultaneously to generate a single image at a resolution of 2.5 metres. Group: Instrument_Details Entry_ID: HRG-1 Group: Instrument_Identification Instrument_Category: Earth Remote Sensing Instruments Instrument_Class: Passive Remote Sensing Instrument_Type: Photon/Optical Detectors Instrument_Subtype: Cameras Short_Name: HRG-1 Long_Name: High Resolution Geometrical Instrument End_Group Group: Associated_Platforms Short_Name: SPOT-5 End_Group Group: Spectral_Frequency_Information Wavelength_Keyword: Visible Spectral_Frequency_Coverage_Range: 0.495 μm - 0.605 μm End_Group Group: Spectral_Frequency_Information Wavelength_Keyword: Visible Spectral_Frequency_Coverage_Range: 0.617 μm - 0.687 μm End_Group Group: Spectral_Frequency_Information Wavelength_Keyword: Near Infrared Spectral_Frequency_Coverage_Range: 0.780 μm - 0.893 μm End_Group Group: Spectral_Frequency_Information Wavelength_Keyword: Near Infrared Spectral_Frequency_Coverage_Range: 1.580 μm - 1.750 μm End_Group Group: Spectral_Frequency_Information Wavelength_Keyword: Visible Spectral_Frequency_Coverage_Range: 0.475 μm - 0.710 μm End_Group Online_Resource: http://www.space-risks.com/SpaceData/index.php?Satellite_Name=SPOT+5&id_page=8 Online_Resource: http://www.cnes.fr/web/1415-spot.php Online_Resource: http://www.spot.com/?countryCode=US&languageCode=en Sample_Image: http://www.space-risks.com/SpaceData/ImaSat/spot5.jpg Creation_Date: 2008-08-25 Group: Instrument_Logistics Instrument_Owner: France/CNES End_Group End_Group

Cameras
type: Concept