RAIN
type: Concept
change note: 2022-08-05 14:12:01.0 [sritz] insert Definition (id: null text: Precipitation in the form of liquid water drops that have diameters greater than 0.5 mm, or, if widely scattered, the drops may be smaller. language code: en);
change note: 2022-08-05 13:04:28.0 [sritz] Insert Concept add broader relation (RAIN [5953d403-41e8-48f7-a4a8-06aaa633e12a,1011366] - LIQUID PRECIPITATION [4ca02520-1345-475c-9a54-b562a042c4e1,1011365]);
in scheme: sciencekeywords
definition: Precipitation in the form of liquid water drops that have diameters greater than 0.5 mm, or, if widely scattered, the drops may be smaller.

LIQUID PRECIPITATION
type: Concept