OV-104
type: Concept
in scheme: platforms
change note: 2021-11-30 12:09:09.0 [tstevens] Move Concepts delete broader relation (null); add broader relation (OV-104 [595c5eb0-2a7d-452b-8a62-d492375b78fa,826268] - Space-based Platforms [b39a69b4-c3b9-4a94-b296-bbbbe5e4c847,835875]);
change note: 2021-11-30 12:14:46.0 [tstevens] Move Concepts delete broader relation (null); add broader relation (OV-104 [595c5eb0-2a7d-452b-8a62-d492375b78fa,826268] - Space Stations/Crewed Spacecraft [388e72a1-b851-4b78-9e69-747e06ae215f,826132]);
change note: 2021-11-30 12:27:55.0 [tstevens] Move Concepts delete broader relation (null); add broader relation (OV-104 [595c5eb0-2a7d-452b-8a62-d492375b78fa,826268] - SPACE SHUTTLE [3ef93fbf-1e19-42a9-a91f-502d125dbb7c,826168]);
definition: Atlantis, the fourth orbiter to become operational at Kennedy Space Center, was named after the primary research vessel for the Woods Hole Oceanographic Institute in Massachusetts from 1930 to 1966. The spaceship Atlantis has carried on the spirit of the sailing vessel with several important voyages of its own, including the Galileo planetary explorer mission in 1989 and the deployment of the Arthur Holley Compton Gamma Ray Observatory in 1991. Atlantis benefited from lessons learned in the construction and testing of Enterprise, Columbia and Challenger. At rollout, its weight was some 6,974 pounds less than Columbia. The Experience gained during the Orbiter assembly process also enabled Atlantis to be completed with a 49.5 percent reduction in man hours (compared to Columbia). Much of this decrease can be attributed to the greater use of thermal protection blankets on the upper orbiter body instead of tiles. During the construction of Discovery and Atlantis, NASA opted to have the various contractors manufacture a set of 'structural spares' to facilitate the repair of an Orbiter if one was damaged during an accident. This contract was valued at &#36389 million and consisted of a spare aft-fuselage, mid-fuselage, forward fuselage halves, vertical tail and rudder, wings, elevons and a body flap. These spares were later assembled into the orbiter Endeavour. Atlantis was shipped to California to undergo upgrades and modifications. These modifications include a drag chute, new plumbing lines that configure the orbiter for extended duration, more than 800 new heat protection tiles and blankets and new insulation for the main landing gear. [Summary provided by NASA] Group: Platform_Details Entry_ID: OV-104 Group: Platform_Identification Platform_Category: Space Stations/Manned Spacecraft Platform_Series_or_Entity: SPACE SHUTTLE Short_Name: OV-104 Long_Name: Atlantis Space Shuttle End_Group Group: Synonymous_Platform_Names Short_Name: Atlantis End_Group Creation_Date: 2008…

Space Shuttle
type: Concept