Indian National Satellite (INSAT)
type: Concept

INSAT-3D
type: Concept
change note: 2021-02-09 11:29:51.0 [sritz] update Definition (INSAT-3D is an advanced weather satellite of India configured with improved Imaging System and Atmospheric Sounder. INSAT-3D is designed for enhanced meteorological observations, monitoring of land and ocean surfaces, generating vertical profile of the atmosphere in terms of temperature and humidity for weather forecasting and disaster warning. It carries four payloads - a) 6 channel multi-spectral Imager b) 19 channel Sounder c) Data Relay Transponder (DRT) d) Search and Rescue Transponder The payloads of INSAT-3D provides continuity and further augment the capability to provide various meteorological as well as search and rescue services. Group: Platform_Details Entry_ID: INSAT-3D Group: Platform_Identification Platform_Category: EARTH OBSERVATION SATELLITES Platform_Series_or_Entity: INSAT (INDIAN NATIONAL SATELLITE) Short_Name: INSAT-3D End_Group Group: Synonymous_Platform_Names Short_Name: INSAT-3D End_Group Group: Platform_Associated_Instruments Short_Name: 3D-IMAGER Short_Name: INSAT-3D SOUNDER End_Group Group: Orbit Orbit_Altitude: 36000 Orbit_Inclination: 0.23 Period: 1428 Perigee: 35469 Apogee: 35799 Orbit_Type: GEO > GEOSYNCHRONOUS > GEOSTATIONARY End_Group Creation_Date: 2014-06-11 Online_Resource: https://www.mosdac.gov.in/insat-3d Group: Platform_Logistics Launch_Date: 2013-07-26 Launch_Site: KOUROU, FRENCH GUIANA Design_Life: 07 years Primary_Sponsor: ISRO End_Group End_Group);
change note: 2021-02-08 17:23:13.0 [sritz] delete Resource (null);
change note: 2014-06-12 09:46:25.0 [mpmorahan] Insert Concept add broader relation (INSAT-3D [5999e653-21ea-49ef-977a-13b5fe40fa36,106461] - INSAT (Indian National Satellite) [949ab40f-3954-4c81-a063-275d0e13a14e,73981]);
in scheme: platforms
definition: INSAT-3D is an advanced weather satellite of India configured with improved Imaging System and Atmospheric Sounder. INSAT-3D is designed for enhanced meteorological observations, monitoring of land and ocean surfaces, generating vertical profile of the atmosphere in terms of temperature and humidity for weather forecasting and disaster warning. It carries four payloads - a) 6 channel multi-spectral Imager b) 19 channel Sounder c) Data Relay Transponder (DRT) d) Search and Rescue Transponder The payloads of INSAT-3D provides continuity and further augment the capability to provide various meteorological as well as search and rescue services. Group: Platform_Details Entry_ID: INSAT-3D Group: Platform_Identification Platform_Category: EARTH OBSERVATION SATELLITES Platform_Series_or_Entity: INSAT (INDIAN NATIONAL SATELLITE) Short_Name: INSAT-3D End_Group Group: Synonymous_Platform_Names Short_Name: INSAT-3D End_Group Group: Platform_Associated_Instruments Short_Name: 3D-IMAGER Short_Name: INSAT-3D SOUNDER End_Group Group: Orbit Orbit_Altitude: 36000 Orbit_Inclination: 0.23 Period: 1428 Perigee: 35469 Apogee: 35799 Orbit_Type: GEO > GEOSYNCHRONOUS > GEOSTATIONARY End_Group Creation_Date: 2014-06-11 Online_Resource: https://www.mosdac.gov.in/insat-3d Group: Platform_Logistics Launch_Date: 2013-07-26 Launch_Site: KOUROU, FRENCH GUIANA Design_Life: 07 years Primary_Sponsor: ISRO End_Group End_Group