HyMeX
type: Concept
change note: 2017-08-10 15:31:45.0 [sritz] Insert Concept add broader relation (HyMeX [59a050da-525a-4416-8e2d-d291f837051d,309875] - G - I [af0968ce-ffe3-44a0-86de-2ec9b9a8fa5d,294133]);
change note: 2017-08-10 15:44:31.0 [sritz] update AltLabel (primary);
change note: 2017-08-10 15:33:30.0 [sritz] insert AltLabel (id: null category: null text: HYdrological cycle in Mediterranean EXperiment (HyMeX) language code: en); insert Definition (id: null text: The HYdrological cycle in Mediterranean EXperiment (HyMeX) aimed to improve the understanding, quantification and modelling of the hydrological cycle in the Mediterranean, with emphasis on the predictability and evolution of extreme weather events, inter-annual to decadal variability of the Mediterranean coupled system, and associated trends in the context of global change. language code: en);
in scheme: projects
definition: The HYdrological cycle in Mediterranean EXperiment (HyMeX) aimed to improve the understanding, quantification and modelling of the hydrological cycle in the Mediterranean, with emphasis on the predictability and evolution of extreme weather events, inter-annual to decadal variability of the Mediterranean coupled system, and associated trends in the context of global change.

G - I
type: Concept