CA/NB/DNR
type: Concept
in scheme: providers
definition: The Department of Natural Resources supplies information about Crown Land, Fish and Wildlife, Forests, Minerals, Mount Carleton and the four Regions that make up New Brunswick. Website: http://www.gnb.ca/0078/

CANADA
type: Concept