SAFS
type: Concept
in scheme: instruments
definition: The Scanning Actinic Flux Spectroradiometer determines wavelength-dependent downwelling actinic fluxes for calculation of photolysis frequencies of photochemically-important compounds. [Summary provided by the NCAR Atmospheric Chemistry Division]

Spectroradiometers
type: Concept