GLONASS
type: Concept
change note: 2017-08-14 15:35:26.0 [tstevens] Insert Concept add broader relation (GLONASS [5a28b2d0-0d67-459a-ac83-b440d9498a06,309951] - GLONASS [7954c30c-becb-4793-83ea-2c53ad0c6706,309935]);
change note: 2017-08-14 15:35:40.0 [tstevens] insert AltLabel (id: null category: primary text: GLObal NAvigation Satellite System language code: en);
change note: 2017-08-15 10:33:51.0 [tstevens] insert Definition (id: null text: GLONASS or "Global Navigation Satellite System", is a space-based satellite navigation system operating in the radionavigation-satellite service. It provides an alternative to GPS and is the second navigational system in operation with global coverage and of comparable precision. language code: en);
definition: GLONASS or "Global Navigation Satellite System", is a space-based satellite navigation system operating in the radionavigation-satellite service. It provides an alternative to GPS and is the second navigational system in operation with global coverage and of comparable precision.
in scheme: instruments

GLONASS
type: Concept