SCAR_A
type: Concept
change note: 2013-06-23 22:55:51.0 [sgrebas] update Definition (The primary objective of the SCAR-A experiment was to help scientists characterize the the relationship between sulfate particles and clouds' reflective properties. Sulfate aerosols are believed to provide condensation nuclei, resulting in smaller, more numerous droplets within a cloud. SCAR-A (America) was the first in a series of experiments. It was followed by the SCAR-C experiment conducted over California in 1994. A third experiment, SCAR-B (Smoke, Clouds and Radiation-Brazil), was conducted in Brazil during August and September 1995. For more information, link to "http://charm.larc.nasa.gov/GUIDE/dataset_documents/base_scar_a_er2_mas_ dataset.html". [Summary provided by NASA]);
in scheme: projects
definition: The primary objective of the SCAR-A experiment was to help scientists characterize the the relationship between sulfate particles and clouds' reflective properties. Sulfate aerosols are believed to provide condensation nuclei, resulting in smaller, more numerous droplets within a cloud. SCAR-A (America) was the first in a series of experiments. It was followed by the SCAR-C experiment conducted over California in 1994. A third experiment, SCAR-B (Smoke, Clouds and Radiation-Brazil), was conducted in Brazil during August and September 1995. For more information, link to "http://charm.larc.nasa.gov/GUIDE/dataset_documents/base_scar_a_er2_mas_ dataset.html". [Summary provided by NASA]

S - U
type: Concept