DE/TERRESTRIS
type: Concept
in scheme: providers
definition: The good results of the project in Rheurdt were the cause for the community of Schwalmtal, a nearby located community with similar erosion problems, to place an order to us for computer-aided soil-erosionmodelling in their area. Several scenarios with the model Erosion-3D were carried out with the task to give an overview of the erosion events in the community area of Schwalmtal-LÃ?ttelforst. Up to now a working group is assigned with the implementation of the model-results. Summary provided by Terrestris

GERMANY
type: Concept