NORPAC ZOOPLANKTON NET
type: Concept
in scheme: instruments
definition: The NORPAC ZOOPLANKTON NET is a mesh net towed vertically for the collection of zooplankton (small floating or weakly swimming animals that are transported with the water currents).

Trawls/Nets
type: Concept