CrIS
type: Concept
definition: The Cross-track Infrared Sounder (CrIS), a Fourier transform spectrometer with 1305 spectral channels, will produce high-resolution, three-dimensional temperature, pressure, and moisture profiles. These profiles will be used to enhance weather forecasting models, and they will facilitate both short- and long-term weather forecasting. Over longer timescales, they will help improve understanding of climate phenomena such as El Niño and La Niña. Mass: <152 kilograms Average Power: <124W Development Organizations: ITT-Fort Wayne, IN; NPP/SDL CrIS Sensor Leads: Joe Predina (ITT), Gail Bingham (NPP/SDL) Purpose: To produce water vapor and temperature profiles of the atmosphere More Information: https://www.jpss.noaa.gov/cris.html Group: Instrument_Details Entry_ID: CrIS Group: Instrument_Identification Instrument_Category: Earth Remote Sensing Instruments Instrument_Class: Passive Remote Sensing Instrument_Type: Profilers/Sounders Short_Name: CrIS Long_Name: Cross-track Infrared Sounder End_Group Group: Associated_Platforms Short_Name: SUOMI-NPP Short_Name: JPSS-1 End_Group Group: Spectral_Frequency_Information Wavelength_Keyword: Infrared > Thermal Number_Channels: 1 Spectral_Frequency_Coverage_Range: LWIR Band 650-1095 cm-1 End_Group Group: Spectral_Frequency_Information Wavelength_Keyword: Infrared > Reflected Number_Channels: 1 Spectral_Frequency_Coverage_Range: MWIR Band 1210-1750 cm-1 End_Group Group: Spectral_Frequency_Information Wavelength_Keyword: Infrared > Reflected Number_Channels: 1 Spectral_Frequency_Coverage_Range: SWIR Band 2155-2550 cm-1 End_Group Group: Spectral_Frequency_Information Wavelength_Keyword: Infrared > Reflected Spectral_Frequency_Resolution: LWIR Band < 0.625 cm-1 End_Group Group: Spectral_Frequency_Information Wavelength_Keyword: Infrared > Reflected Spectral_Frequency_Resolution: MWIR Band < 1.25 cm-1 End_Group Group: Spectral_Frequency_Information Wavelength_Keyword: Infrared > Reflected Spectral_Frequency_Resolution: SWIR Band < 2.50 cm…
in scheme: instruments
change note: 2017-08-29 16:16:00.0 [sritz] update Definition (The Cross-track Infrared Sounder (CrIS), a Fourier transform spectrometer with 1305 spectral channels, will produce high-resolution, three-dimensional temperature, pressure, and moisture profiles. These profiles will be used to enhance weather forecasting models, and they will facilitate both short- and long-term weather forecasting. Over longer timescales, they will help improve understanding of climate phenomena such as El Niño and La Niña. Mass: <152 kilograms Average Power: <124W Development Organizations: ITT-Fort Wayne, IN; NPP/SDL CrIS Sensor Leads: Joe Predina (ITT), Gail Bingham (NPP/SDL) Purpose: To produce water vapor and temperature profiles of the atmosphere More Information: https://npp.gsfc.nasa.gov/cris.html Group: Instrument_Details Entry_ID: CrIS Group: Instrument_Identification Instrument_Category: Earth Remote Sensing Instruments Instrument_Class: Passive Remote Sensing Instrument_Type: Profilers/Sounders Short_Name: CrIS Long_Name: Cross-track Infrared Sounder End_Group Group: Associated_Platforms Short_Name: SUOMI-NPP Short_Name: JPSS-1 End_Group Group: Spectral_Frequency_Information Wavelength_Keyword: Infrared > Thermal Number_Channels: 1 Spectral_Frequency_Coverage_Range: LWIR Band 650-1095 cm-1 End_Group Group: Spectral_Frequency_Information Wavelength_Keyword: Infrared > Reflected Number_Channels: 1 Spectral_Frequency_Coverage_Range: MWIR Band 1210-1750 cm-1 End_Group Group: Spectral_Frequency_Information Wavelength_Keyword: Infrared > Reflected Number_Channels: 1 Spectral_Frequency_Coverage_Range: SWIR Band 2155-2550 cm-1 End_Group Group: Spectral_Frequency_Information Wavelength_Keyword: Infrared > Reflected Spectral_Frequency_Resolution: LWIR Band < 0.625 cm-1 End_Group Group: Spectral_Frequency_Information Wavelength_Keyword: Infrared > Reflected Spectral_Frequency_Resolution: MWIR Band < 1.25 cm-1 End_Group Group: Spectral_Frequency_Information Wavelength_Keyword: Infrared > Reflected S…
change note: 2018-02-02 12:40:30.0 [sritz] update WeightedRelation (Platform-Instrument); update WeightedRelation (1.0); update WeightedRelation (Platform-Instrument); update WeightedRelation (1.0); update WeightedRelation (Platform-Instrument); update WeightedRelation (1.0); update WeightedRelation (Platform-Instrument); update WeightedRelation (1.0);
change note: 2018-02-02 12:38:24.0 [sritz] insert WeightedRelation (id: null related concept uuid: 586db0b3-5f94-466e-b7c1-a2dbedc0c1fc relationship type: null relationship value: null generated by: null); insert WeightedRelation (id: null related concept uuid: 043dc242-1014-4e9a-91ee-c472b791b026 relationship type: null relationship value: null generated by: null); insert WeightedRelation (id: null related concept uuid: 2ab4ba32-0bb3-4e4e-bac6-1ff4a3baf0df relationship type: null relationship value: null generated by: null); insert WeightedRelation (id: null related concept uuid: 10adce36-ce10-4ae6-94f9-211911c7dd15 relationship type: null relationship value: null generated by: null);
change note: 2019-10-04 16:24:45.0 [sritz] update Definition (The Cross-track Infrared Sounder (CrIS), a Fourier transform spectrometer with 1305 spectral channels, will produce high-resolution, three-dimensional temperature, pressure, and moisture profiles. These profiles will be used to enhance weather forecasting models, and they will facilitate both short- and long-term weather forecasting. Over longer timescales, they will help improve understanding of climate phenomena such as El Niño and La Niña. Mass: <152 kilograms Average Power: <124W Development Organizations: ITT-Fort Wayne, IN; NPP/SDL CrIS Sensor Leads: Joe Predina (ITT), Gail Bingham (NPP/SDL) Purpose: To produce water vapor and temperature profiles of the atmosphere More Information: https://www.jpss.noaa.gov/cris.html Group: Instrument_Details Entry_ID: CrIS Group: Instrument_Identification Instrument_Category: Earth Remote Sensing Instruments Instrument_Class: Passive Remote Sensing Instrument_Type: Profilers/Sounders Short_Name: CrIS Long_Name: Cross-track Infrared Sounder End_Group Group: Associated_Platforms Short_Name: SUOMI-NPP Short_Name: JPSS-1 End_Group Group: Spectral_Frequency_Information Wavelength_Keyword: Infrared > Thermal Number_Channels: 1 Spectral_Frequency_Coverage_Range: LWIR Band 650-1095 cm-1 End_Group Group: Spectral_Frequency_Information Wavelength_Keyword: Infrared > Reflected Number_Channels: 1 Spectral_Frequency_Coverage_Range: MWIR Band 1210-1750 cm-1 End_Group Group: Spectral_Frequency_Information Wavelength_Keyword: Infrared > Reflected Number_Channels: 1 Spectral_Frequency_Coverage_Range: SWIR Band 2155-2550 cm-1 End_Group Group: Spectral_Frequency_Information Wavelength_Keyword: Infrared > Reflected Spectral_Frequency_Resolution: LWIR Band < 0.625 cm-1 End_Group Group: Spectral_Frequency_Information Wavelength_Keyword: Infrared > Reflected Spectral_Frequency_Resolution: MWIR Band < 1.25 cm-1 End_Group Group: Spectral_Frequency_Information Wavelength_Keyword: Infrared > Reflected S…
change note: 2017-08-16 10:51:29.0 [sritz] update Definition (The Cross-track Infrared Sounder (CrIS), a Fourier transform spectrometer with 1305 spectral channels, will produce high-resolution, three-dimensional temperature, pressure, and moisture profiles. These profiles will be used to enhance weather forecasting models, and they will facilitate both short- and long-term weather forecasting. Over longer timescales, they will help improve understanding of climate phenomena such as El Niño and La Niña. Mass: <152 kilograms Average Power: <124W Development Organizations: ITT-Fort Wayne, IN; NPP/SDL CrIS Sensor Leads: Joe Predina (ITT), Gail Bingham (NPP/SDL) Purpose: To produce water vapor and temperature profiles of the atmosphere More Information: https://npp.gsfc.nasa.gov/cris.html Group: Instrument_Details Entry_ID: CRIS-NPOESS Group: Instrument_Identification Instrument_Category: Earth Remote Sensing Instruments Instrument_Class: Passive Remote Sensing Instrument_Type: Profilers/Sounders Short_Name: CRIS-NPOESS Long_Name: Cross-track Infrared Sounder End_Group Group: Associated_Platforms Short_Name: SUOMI-NPP Short_Name: JPSS-1 End_Group Group: Spectral_Frequency_Information Wavelength_Keyword: Infrared > Thermal Number_Channels: 1 Spectral_Frequency_Coverage_Range: LWIR Band 650-1095 cm-1 End_Group Group: Spectral_Frequency_Information Wavelength_Keyword: Infrared > Reflected Number_Channels: 1 Spectral_Frequency_Coverage_Range: MWIR Band 1210-1750 cm-1 End_Group Group: Spectral_Frequency_Information Wavelength_Keyword: Infrared > Reflected Number_Channels: 1 Spectral_Frequency_Coverage_Range: SWIR Band 2155-2550 cm-1 End_Group Group: Spectral_Frequency_Information Wavelength_Keyword: Infrared > Reflected Spectral_Frequency_Resolution: LWIR Band < 0.625 cm-1 End_Group Group: Spectral_Frequency_Information Wavelength_Keyword: Infrared > Reflected Spectral_Frequency_Resolution: MWIR Band < 1.25 cm-1 End_Group Group: Spectral_Frequency_Information Wavelength_Keyword: Infrared…
change note: 2012-10-19 10:40:23.0 [saritz] Changed CRIS-NPOESS to CRIS-NPP update PrefLabel (CRIS-NPP);
change note: 2017-08-16 10:49:50.0 [sritz] update Definition (The Cross-track Infrared Sounder (CrIS), a Fourier transform spectrometer with 1305 spectral channels, will produce high-resolution, three-dimensional temperature, pressure, and moisture profiles. These profiles will be used to enhance weather forecasting models, and they will facilitate both short- and long-term weather forecasting. Over longer timescales, they will help improve understanding of climate phenomena such as El Niño and La Niña. Mass: <152 kilograms Average Power: <124W Development Organizations: ITT-Fort Wayne, IN; NPP/SDL CrIS Sensor Leads: Joe Predina (ITT), Gail Bingham (NPP/SDL) Purpose: To produce water vapor and temperature profiles of the atmosphere More Information: https://npp.gsfc.nasa.gov/cris.html Group: Instrument_Details Entry_ID: CRIS-NPOESS Group: Instrument_Identification Instrument_Category: Earth Remote Sensing Instruments Instrument_Class: Passive Remote Sensing Instrument_Type: Profilers/Sounders Short_Name: CRIS-NPOESS Long_Name: Cross-track Infrared Sounder End_Group Group: Associated_Platforms Short_Name: SUOMI-NPP Short_Name: JPSS-1 End_Group Group: Spectral_Frequency_Information Wavelength_Keyword: Infrared > Thermal Number_Channels: 1 Spectral_Frequency_Coverage_Range: LWIR Band 650-1095 cm-1 End_Group Group: Spectral_Frequency_Information Wavelength_Keyword: Infrared > Reflected Number_Channels: 1 Spectral_Frequency_Coverage_Range: MWIR Band 1210-1750 cm-1 End_Group Group: Spectral_Frequency_Information Wavelength_Keyword: Infrared > Reflected Number_Channels: 1 Spectral_Frequency_Coverage_Range: SWIR Band 2155-2550 cm-1 End_Group Group: Spectral_Frequency_Information Wavelength_Keyword: Infrared > Reflected Spectral_Frequency_Resolution: LWIR Band < 0.625 cm-1 End_Group Group: Spectral_Frequency_Information Wavelength_Keyword: Infrared > Reflected Spectral_Frequency_Resolution: MWIR Band < 1.25 cm-1 End_Group Group: Spectral_Frequency_Information Wavelength_Keyword: Infrared…
change note: 2017-08-11 12:04:18.0 [sritz] S. Ritz removed -NPP and made short name mixed case. update PrefLabel (CrIS); update Definition (The Cross-track Infrared Sounder (CrIS), a Fourier transform spectrometer with 1305 spectral channels, will produce high-resolution, three-dimensional temperature, pressure, and moisture profiles. These profiles will be used to enhance weather forecasting models, and they will facilitate both short- and long-term weather forecasting. Over longer timescales, they will help improve understanding of climate phenomena such as El Niño and La Niña. Mass: <152 kilograms Average Power: <124W Development Organizations: ITT-Fort Wayne, IN; NPP/SDL CrIS Sensor Leads: Joe Predina (ITT), Gail Bingham (NPP/SDL) Purpose: To produce water vapor and temperature profiles of the atmosphere More Information: http://npp.gsfc.nasa.gov/cris.html Group: Instrument_Details Entry_ID: CRIS-NPOESS Group: Instrument_Identification Instrument_Category: Earth Remote Sensing Instruments Instrument_Class: Passive Remote Sensing Instrument_Type: Profilers/Sounders Short_Name: CRIS-NPOESS Long_Name: Cross-track Infrared Sounder End_Group Group: Associated_Platforms Short_Name: SUOMI-NPP Short_Name: JPSS-1 End_Group Group: Spectral_Frequency_Information Wavelength_Keyword: Infrared > Thermal Number_Channels: 1 Spectral_Frequency_Coverage_Range: LWIR Band 650-1095 cm-1 End_Group Group: Spectral_Frequency_Information Wavelength_Keyword: Infrared > Reflected Number_Channels: 1 Spectral_Frequency_Coverage_Range: MWIR Band 1210-1750 cm-1 End_Group Group: Spectral_Frequency_Information Wavelength_Keyword: Infrared > Reflected Number_Channels: 1 Spectral_Frequency_Coverage_Range: SWIR Band 2155-2550 cm-1 End_Group Group: Spectral_Frequency_Information Wavelength_Keyword: Infrared > Reflected Spectral_Frequency_Resolution: LWIR Band < 0.625 cm-1 End_Group Group: Spectral_Frequency_Information Wavelength_Keyword: Infrared > Reflected Spectral_Frequency_Resolution: MWIR Band < 1.25 cm-1…
change note: 2019-10-04 16:20:47.0 [sritz] update Definition (The Cross-track Infrared Sounder (CrIS), a Fourier transform spectrometer with 1305 spectral channels, will produce high-resolution, three-dimensional temperature, pressure, and moisture profiles. These profiles will be used to enhance weather forecasting models, and they will facilitate both short- and long-term weather forecasting. Over longer timescales, they will help improve understanding of climate phenomena such as El Niño and La Niña. Mass: <152 kilograms Average Power: <124W Development Organizations: ITT-Fort Wayne, IN; NPP/SDL CrIS Sensor Leads: Joe Predina (ITT), Gail Bingham (NPP/SDL) Purpose: To produce water vapor and temperature profiles of the atmosphere More Information: https://www.jpss.noaa.gov/cris.html Group: Instrument_Details Entry_ID: CrIS Group: Instrument_Identification Instrument_Category: Earth Remote Sensing Instruments Instrument_Class: Passive Remote Sensing Instrument_Type: Profilers/Sounders Short_Name: CrIS Long_Name: Cross-track Infrared Sounder End_Group Group: Associated_Platforms Short_Name: SUOMI-NPP Short_Name: JPSS-1 End_Group Group: Spectral_Frequency_Information Wavelength_Keyword: Infrared > Thermal Number_Channels: 1 Spectral_Frequency_Coverage_Range: LWIR Band 650-1095 cm-1 End_Group Group: Spectral_Frequency_Information Wavelength_Keyword: Infrared > Reflected Number_Channels: 1 Spectral_Frequency_Coverage_Range: MWIR Band 1210-1750 cm-1 End_Group Group: Spectral_Frequency_Information Wavelength_Keyword: Infrared > Reflected Number_Channels: 1 Spectral_Frequency_Coverage_Range: SWIR Band 2155-2550 cm-1 End_Group Group: Spectral_Frequency_Information Wavelength_Keyword: Infrared > Reflected Spectral_Frequency_Resolution: LWIR Band < 0.625 cm-1 End_Group Group: Spectral_Frequency_Information Wavelength_Keyword: Infrared > Reflected Spectral_Frequency_Resolution: MWIR Band < 1.25 cm-1 End_Group Group: Spectral_Frequency_Information Wavelength_Keyword: Infrared > Reflected S…

Profilers/Sounders
type: Concept