DHHS
type: Concept

DHHS/CDC/NCIDOD/FDDB/FOODNET
type: Concept
in scheme: providers
definition: CDC′s Mission is &to promote health and quality of life by preventing and controlling disease, injury, and disability.& CDC′s Vision for the 21st Century is &Healthy People in a Healthy WorldThrough Prevention.& CDC Fact Sheet The Centers for Disease Control and Prevention is the nations premier public health agencyworking to ensure healthy people in a healthy world Summary provided by http://www.cdc.gov/about/