INUNDATION LEVEL
type: Concept
change note: 2016-04-04 09:31:28.0 [gee-cee] update Definition (The level of the water that covers an area during flooding.);
change note: 2016-03-31 09:42:26.0 [gee-cee] insert Definition (id: null text: The level of the water that covers an area during flooding language code: en);
change note: 2016-03-31 09:41:57.0 [gee-cee] Insert Concept add broader relation (INUNDATION LEVEL [5af94668-05f5-41ee-aa65-82dca2a359fc,158753] - INUNDATION [c6c0c5dd-c0ca-4670-bbaa-c22d39e73570,84557]);
in scheme: sciencekeywords
definition: The level of the water that covers an area during flooding.

INUNDATION
type: Concept