NON-GOVERNMENT/NON-PROFIT ORGANIZATIONS
type: Concept

AUDUBON/MA
type: Concept
in scheme: providers
definition: Mass Audubon works to protect the nature of Massachusetts for people and wildlife. Together with more than 100,000 members, we care for 33,000 acres of conservation land, provide educational programs for 200,000 children and adults annually, and advocate for sound environmental policies at local, state, and federal levels. Mass Audubon's mission and actions have expanded since our beginning in 1896 when our founders set out to stop the slaughter of birds for use on women's fashions. Today we are the largest conservation organization in New England. Our statewide network of 45 wildlife sanctuaries welcomes visitors of all ages and serves as the base for our conservation, education, and advocacy work. To support these important efforts, call 800-AUDUBON (283-8266) or visit www.massaudubon.org. Summary Provided By: http://www.massaudubon.org/about/index.php