TCI
type: Concept
change note: 2021-08-27 12:18:45.0 [tstevens] insert AltLabel (id: null category: primary text: Tropical Cyclone Intensity language code: en); insert Definition (id: null text: Tropical cyclone (TC) outflow and its relationship to TC intensity change and structure were investigated in the Office of Naval Research Tropical Cyclone Intensity (TCI) field program during 2015 using dropsondes deployed from the innovative new HDSS (High Definition Sounding System) and remotely sensed observations from HIRAD (Hurricane Imaging Radiometer), both onboard the NASA WB-57 that flew in the lower stratosphere. language code: en);
change note: 2021-08-27 12:15:09.0 [tstevens] Insert Concept add broader relation (TCI [5bdeb9a4-d23b-4bb2-99fd-311e6fb79d40,720873] - S - U [4eb1894b-35b4-406b-8864-944a42bc7702,714491]);
change note: 2021-08-30 08:30:51.0 [tstevens] update Definition (https://data.eol.ucar.edu/project/TCI);
in scheme: projects
definition: Tropical cyclone (TC) outflow and its relationship to TC intensity change and structure were investigated in the Office of Naval Research Tropical Cyclone Intensity (TCI) field program during 2015 using dropsondes deployed from the innovative new HDSS (High Definition Sounding System) and remotely sensed observations from HIRAD (Hurricane Imaging Radiometer), both onboard the NASA WB-57 that flew in the lower stratosphere.

S - U
type: Concept