EMP
type: Concept
in scheme: projects
definition: Recording, evaluating, and actively intervening over time in the interaction of living and nonliving elements in a specific environment. Information provided by http://www.usgs.gov/science/science.php?term=317&b=20&n=10

D - F
type: Concept