TIRS-PREFIRE
type: Concept
in scheme: instruments
change note: 2023-06-06 09:35:41.0 [sritz] Insert Concept add broader relation (TIRS-PREFIRE [5c10ecbc-ca56-4f5e-bfa8-8a16fb68d82d,1335756] - Spectrometers [055a79c7-61db-4250-abad-f1e09909f14c,1326538]);
change note: 2023-06-06 09:41:19.0 [sritz] insert Definition (id: null text: The Polar Radiant Energy in the Far-Infrared Experiment (PREFIRE) consists of two 6U CubeSats that each host a Thermal Infrared Spectrometer (TIRS) instrument. The CubeSats are scheduled for launch in March and October of 2023. The purpose of the TIRS instrument is to make spectrally resolved measurements of the Earth’s thermal radiation from the top of the atmosphere. PREFIRE will document, for the first time, variability in spectral fluxes from 4 to 54 microns on hourly to seasonal timescales. The primary mission is 12 months in a polar orbit with inclination of 82 to 98 at altitudes between 450 km and 650 km. The TIRS instrument is an Offner spectrometer that uses a thermopile detector array and a Schwarzchild telescope. In addition, there is a scan mirror which is periodically actuated for calibration. The instrument concept of operation is to collect radiation emitted towards zenith in a nadir sounding orientation with periodic internal and space calibrations. The TIRS thermal control architecture consists of entirely passive elements. The instrument requires all elements be maintained between 0 C and 50 C during operation for the duration of the mission. An overview of the overall thermal control design approach is presented. language code: en);
change note: 2023-06-06 09:36:01.0 [sritz] insert AltLabel (id: null category: primary text: Thermal InfraRed Spectrometer language code: en);
definition: The Polar Radiant Energy in the Far-Infrared Experiment (PREFIRE) consists of two 6U CubeSats that each host a Thermal Infrared Spectrometer (TIRS) instrument. The CubeSats are scheduled for launch in March and October of 2023. The purpose of the TIRS instrument is to make spectrally resolved measurements of the Earth’s thermal radiation from the top of the atmosphere. PREFIRE will document, for the first time, variability in spectral fluxes from 4 to 54 microns on hourly to seasonal timescales. The primary mission is 12 months in a polar orbit with inclination of 82 to 98 at altitudes between 450 km and 650 km. The TIRS instrument is an Offner spectrometer that uses a thermopile detector array and a Schwarzchild telescope. In addition, there is a scan mirror which is periodically actuated for calibration. The instrument concept of operation is to collect radiation emitted towards zenith in a nadir sounding orientation with periodic internal and space calibrations. The TIRS thermal control architecture consists of entirely passive elements. The instrument requires all elements be maintained between 0 C and 50 C during operation for the duration of the mission. An overview of the overall thermal control design approach is presented.

Spectrometers
type: Concept