HAZARDS PLANNING
type: Concept
in scheme: sciencekeywords
definition: Planning refers to the formulation of a course of action to be taken in the event of a hazard emergency.

HAZARDS MANAGEMENT
type: Concept