CRYOSPHERIC INDICATORS
type: Concept

SEA ICE ELEVATION
type: Concept
change note: 2012-07-10 15:47:28.0 [mpmorahan] insert Definition (id: null text: Pertains to the measurement of the surface height of the sea ice. In particular, sea ice elevation is measured by the radar altimeter on board the NASA IceSat satellite. language code: en);
change note: 2012-06-26 13:39:17.0 [gee-cee] Insert Concept add broader relation (SEA ICE ELEVATION [5d5cf73b-f833-4f8d-84a1-8a3840f3b4af,39937] - CRYOSPHERIC INDICATORS [76b8c21c-c221-4724-86ef-c07222cb152b,39899]);
in scheme: sciencekeywords
definition: Pertains to the measurement of the surface height of the sea ice. In particular, sea ice elevation is measured by the radar altimeter on board the NASA IceSat satellite.