TEMPERATE CONIFEROUS FOREST
type: Concept
change note: 2016-06-13 12:08:07.0 [gee-cee] insert Definition (id: null text: Pertaining to forests consisting of coniferous-evergreen trees and characterized by well-defined seasons with cold, long snowy winters and warm, humid summers. language code: en);
change note: 2016-06-13 12:07:40.0 [gee-cee] Insert Concept add broader relation (TEMPERATE CONIFEROUS FOREST [5d8236b5-bf5b-499f-a8e7-0cd80e00d261,188179] - FORESTS [46e4aaa4-349c-4049-a910-035391360010,83507]);
in scheme: sciencekeywords
definition: Pertaining to forests consisting of coniferous-evergreen trees and characterized by well-defined seasons with cold, long snowy winters and warm, humid summers.

FORESTS
type: Concept