V - Z
type: Concept

VOCAR
type: Concept
in scheme: projects
definition: An experiment called Variability of Coastal Atmospheric Refractivity (VOCAR) was designed under a larger program called Coastal Variability Analysis, Measurements, and Prediction. VOCAR is a multi-year experimental effort to investigate the variability of atmospheric refractivity with emphasis on the coastal zone. The experiment is being conducted by the Naval Command, Control and Ocean Surveillance Center RDT&E Division jointly with the Naval Air Warfare Center Weapons Division, Point Mugu, CA, the Naval Research Laboratory (Washington, DC and Monterey), and the Naval Postgraduate School. In addition, the National Oceanic and Atmospheric Administration Environmental Technology Laboratory, Penn State University Applied Research Laboratory and Johns Hopkins University Applied Physics Laboratory participated in the intensive measurement phase of VOCAR. The objectives of VOCAR are to provide an assessment capability for horizontally varying refractivity conditions in a coastal environment and to develop a remote sensing capability. The propagation measurements being made during VOCAR consist of monitoring signal strength variations of VHF/UHF transmitters in the southern California coastal region. Corresponding meteorological measurements are made during routine, special, and intensive observation periods. Information provided by http://stinet.dtic.mil/oai/oai?&verb=getRecord&metadataPrefix=html&identifier=ADA289202