IRELAND
type: Concept

IE/MOSAIC
type: Concept
in scheme: providers
definition: AGI Northern Ireland regional group was formed in 2001, and officially launched in 2002, to raise awareness of geographic information (GI) within Northern Ireland, and to encourage the sharing of knowledge and data between those with an interest in GI. Since its formation, AGI Northern Ireland (AGI-NI) has established, and maintained, strong partnerships with a range of public and private sector organisations, locally, as well as further afield. Summary Provided By: http://www.agi.org.uk/bfora/user/systems/sig/view.asp?sig=284&arg=1