CAMP2Ex
type: Concept
change note: 2020-03-26 17:36:45.0 [sritz] update WeightedRelation (Platform-Instrument); update WeightedRelation (1.0);
change note: 2020-03-26 17:26:48.0 [sritz] Insert Concept add broader relation (CAMP2Ex [5e573a56-b485-4a7f-a652-6d941e7d0ce0,559885] - A - C [0c89f3f4-7ab1-43ce-89ee-795d35f0e30a,546613]);
change note: 2021-03-29 09:06:59.0 [tstevens] update AltLabel (Clouds, Aerosol and Monsoon Processes-Philippines Experiment);
change note: 2020-03-26 17:29:33.0 [sritz] insert Definition (id: null text: The Cloud, Aerosol and Monsoon Processes Philippines Experiment (CAMP2Ex) is a response to the need to deconvolute the fields of tropical meteorology and aerosol science at the meso-b to cloud level. The NASA Earth Science Division will be operating NASA’s P-3 (tail number N426NA) research aircraft and the SPEC, Inc. Lear Jet 35A (tail number N474KA) out of Clark Airport in the Philippines during the period 20 August to 10 October 2019. language code: en);
change note: 2020-03-26 18:03:28.0 [sritz] update WeightedRelation (Undefined);
change note: 2020-03-26 17:40:37.0 [sritz] update WeightedRelation (Platform-Instrument); update WeightedRelation (1.0);
change note: 2020-03-26 17:36:07.0 [sritz] insert WeightedRelation (id: null related concept uuid: 45abac35-586f-4fed-ac38-5dcd59af2cc5 relationship type: null relationship value: null generated by: null);
change note: 2020-03-26 17:27:53.0 [sritz] insert AltLabel (id: null category: primary text: Clouds, Aerosol, and Monsoon Processes-Phillipines Experiment language code: en);
change note: 2020-03-26 17:39:56.0 [sritz] insert WeightedRelation (id: null related concept uuid: 5c7ba790-030e-4cd6-99e8-9fe9809c5052 relationship type: null relationship value: null generated by: null);
definition: The Cloud, Aerosol and Monsoon Processes Philippines Experiment (CAMP2Ex) is a response to the need to deconvolute the fields of tropical meteorology and aerosol science at the meso-b to cloud level. The NASA Earth Science Division will be operating NASA’s P-3 (tail number N426NA) research aircraft and the SPEC, Inc. Lear Jet 35A (tail number N474KA) out of Clark Airport in the Philippines during the period 20 August to 10 October 2019.
in scheme: projects

A - C
type: Concept