USC/GEOL/SEIS
type: Concept
in scheme: providers
definition: The seismology program at USC is involved in the study of earthquakes, lithospheric processes, and the internal structure of the earth, as well as generating interest in the world of seismology through education. Website; http://www.seis.sc.edu/

ACADEMIC
type: Concept