EURIMAGE
type: Concept
in scheme: providers
definition: For more than thirteen years, Eurimage has provided global satellite digital and photographic data, both directly to end customers and through a network of more than 150 expert Application Providers world-wide. Products include visible and infrared optical data and radar, offering a variety of mission and sensor types to meet the widest range of user needs. . Institutional clients include the Joint Research Centre of the European Union, the UN Food and Agriculture Organization, UN High Commission for Refugees, the European Union Satellite Centre and other international organizations. Eurimage?s shareholders are Telespazio (Italy), and Astrium (Germany/France/UK). Website: "http://www.eurimage.com/" [Summary provided by Eurimage]

COMMERCIAL
type: Concept