CORAL REEFS
type: Concept

TABLE REEF
type: Concept
change note: 2013-03-29 09:51:59.0 [tbs1979] insert Definition (id: null text: An isolated reef, approaching an atoll type, but without a lagoon. language code: en);
change note: 2013-02-18 12:24:58.0 [tbs1979] Insert Concept add broader relation (TABLE REEF [5f4dc81d-0893-4eb9-b82a-6a070836aa16,82575] - CORAL REEFS [dff4d4af-e1e0-4991-884b-a1c088a802b2,82559]);
in scheme: sciencekeywords
definition: An isolated reef, approaching an atoll type, but without a lagoon.