ASC
type: Concept
in scheme: instruments
definition: A All-Sky cameras is a camera that uses special optical elements such as fish-eye lenses or spherical mirrors to acquire an image of the whole sky in one shot (hence the name). Additional information available at "http://sprg.ssl.berkeley.edu/atmos/sondre.html" [Summary provided by University of Berkeley]

Cameras
type: Concept