M - O
type: Concept

MARIS
type: Concept
in scheme: projects
definition: The Multistate Aquatic Resources Information System (MARIS) is a six state cooperative pilot project to make accessible, via a common, internet-based application, selected fish population survey data from each of the cooperating states. MARIS states include Illinois, Iowa, Michigan, Minnesota, Ohio, and Wisconsin. These states have developed a statewide fisheries survey database containing information on relative or absolute abundance of fish species, morphometry, location, and water chemistry in selected lakes. Each state will maintain authority and responsibility for its own database, but will support internet access through a defined set of summary queries and reports. Information provided by http://www.marisdata.org/