CAWSES
type: Concept
in scheme: projects
definition: CAWSES (Climate And Weather of the Sun-Earth System) is an international program sponsored by SCOSTEP (Scientific Committee on Solar-Terrestrial Physics) established with an aim of significantly enhancing our understanding of the space environment and its impacts on life and society. The main functions of CAWSES are to help coordinate international activities in observations, modeling, and applications crucial to achieving this understanding, to involve scientists in both developed and developing countries, and to provide educational opportunities for students of all levels. Project URL: http://www.bu.edu/cawses/index.html

A - C
type: Concept