CA/NRC/DRAO
type: Concept
in scheme: providers
definition: The Dominion Radio Astrophysical Observatory operates the seven-antenna Synthesis Telescope (ST), the 26-meter Telescope, and the 10-cm Solar Flux Monitor. It is a member of the Canadian Galactic Plane Survey, a project to map 60 degrees of the Galactic plane at numerous wavelengths with a uniform sensitivity. The data from the LRDS, a survey of HI in the Galactic plane, are now available. Other projects at the DRAO site include the JCMT correlator, space VLBI, Large Adaptive Reflector, EVLA Correlator. Website: "http://www.drao-ofr.hia-iha.nrc-cnrc.gc.ca/" [Summary provided by the Dominion Radio Astrophysical Observatory]

CANADA
type: Concept