CA/NEB
type: Concept
in scheme: providers
definition: "http://www.neb.gc.ca/" We promote Safety, Environmental Protection and Economic Efficiency in the Canadian public interest while respecting individual rights and within the mandate set by Parliament in the regulation of pipelines, energy development and trade. We achieve our purpose by regulating in the Canadian public interest: the construction and operation of interprovincial and international pipelines the tolls and tariffs of interprovincial and international pipelines the construction and the operation of international power lines the exports of oil and electricity the exports and imports of natural gas, and the exploration and development of oil and gas resources in non-Accord frontier areas. When we have expertise derived from these regulatory functions, we also report to and advise the Minister of Natural Resources Canada on energy issues.

CANADA
type: Concept